ssDNA
type: Concept
definition: Single stranded deoxyribonucleic acid (ssDNA) is a polymer composed of one polynucleotide chain. ssDNA is a nucleic acids.
broader: https://sms-cv.helmholtz.cloud/sms/cv/api/v1/compartments/2/