Snow
type: Concept
alternative label: Sn
broader: https://sms-cv.helmholtz.cloud/sms/cv/api/v1/compartments/3/
definition: Observation in, of or sample taken from snow.
narrower: https://sms-cv.helmholtz.cloud/sms/cv/api/v1/measuredquantities/208/
narrower: https://sms-cv.helmholtz.cloud/sms/cv/api/v1/measuredquantities/290/
narrower: https://sms-cv.helmholtz.cloud/sms/cv/api/v1/measuredquantities/291/