Sediment
type: Concept
definition: Specimen collected from material broken down by processes of weathering and erosion and subsequently transported by the action of wind, water, or ice, and/or by the force of gravity acting on the particles. Sensors may also be emplaced to measure sediment properties.
broader: https://sms-cv.helmholtz.cloud/sms/cv/api/v1/compartments/4/
alternative label: Se