Precipitation height, liquid
type: Concept
broader: https://sms-cv.helmholtz.cloud/sms/cv/api/v1/samplingmedia/9/
definition: Precipitation height, the liquid portion of the precipitation. Default min/max values valid for minute-values according to WMO quality control Guidelines.