Limit value
type: Concept
alternative label: Threshold
broader: https://sms-cv.helmholtz.cloud/sms/cv/api/v1/samplingmedia/1/
definition: Typically binary value if a fixed limit value is reached, e.g. max filling level or any other limit or threshold.