GPS position, latitude
type: Concept
alternative label: Lat
alternative label: Latitude
broader: https://sms-cv.helmholtz.cloud/sms/cv/api/v1/samplingmedia/5/
definition: If ellipsoid differs from WGS84 please note the reference ellipsoid.