GPS position, height
type: Concept
alternative label: ALT
alternative label: Altitude
broader: https://sms-cv.helmholtz.cloud/sms/cv/api/v1/samplingmedia/5/
definition: Please note or choose reference height (ellipsoid or geoid).