Amplitude
type: Concept
broader: https://sms-cv.helmholtz.cloud/sms/cv/api/v1/samplingmedia/1/
definition: A physical quality of a process inhering in a bearer by virtue of the size of the bearer's maximum displacement from the 'normal' position, when periodic motion is taking place.