Acceleration, y-component
type: Concept
broader: https://sms-cv.helmholtz.cloud/sms/cv/api/v1/samplingmedia/13/
definition: A physical quality inhering in a bearer by virtue of the rate of change of the bearer's velocity in either speed or direction. Y-component of acceleration.