Real dielectric constant
type: Concept
broader: https://sms-cv.helmholtz.cloud/sms/cv/api/v1/samplingmedia/6/
definition: Soil reponse of a reflected standing electromagnetic wave of a particular frequency which is related to the stored energy within the medium. This is the real portion of the complex dielectric constant.