Lightning
type: Concept
definition: Lightning is a natural phenomenon consisting of electrostatic discharges occurring through the atmosphere between two electrically charged regions.
broader: https://sms-cv.helmholtz.cloud/sms/cv/api/v1/samplingmedia/9/