Water vapor mixing ratio
type: Concept
definition: The ratio of the mass of a variable atmospheric constituent to the mass of dry air.
broader: https://sms-cv.helmholtz.cloud/sms/cv/api/v1/samplingmedia/9/
alternative label: humidity_mixing_ratio