Precipitation particle speed
type: Concept
alternative label: Particle velocity
broader: https://sms-cv.helmholtz.cloud/sms/cv/api/v1/samplingmedia/9/
definition: Mean downward velocity of particles within each specific particle size class.