Wind speed, lateral
type: Concept
alternative label: Crosswind
broader: https://sms-cv.helmholtz.cloud/sms/cv/api/v1/samplingmedia/9/
definition: The speed of the air (absolute) in the atmosphere. Lateral component of wind speed.