Altitude
type: Concept
definition: Altitude is the (geometric) height above the geoid, which is the reference geopotential surface. The geoid is similar to mean sea level.
broader: https://sms-cv.helmholtz.cloud/sms/cv/api/v1/samplingmedia/5/