Frame count, data
type: Concept
definition: The frame counter is a counter that is incremented by the value 1 with each transmission.
broader: https://sms-cv.helmholtz.cloud/sms/cv/api/v1/samplingmedia/1/