particle size
type: Concept
broader: https://sms-cv.helmholtz.cloud/sms/cv/api/v1/samplingmedia/9/
definition: Particle size is a notion introduced for comparing dimensions of solid particles (flecks), liquid particles (droplets), or gaseous particles (bubbles). The notion of particle size applies to particles in colloids, in ecology, in granular material (whether airborne or not), and to particles that form a granular material (see also grain size).