Ice nucleating particle number concentration
type: Concept
broader: https://sms-cv.helmholtz.cloud/sms/cv/api/v1/samplingmedia/9/
definition: Number per unit volume of particles able to serve as condensation nuclei for ice phase cloud particles