Matrix Potential
type: Concept
definition: When water is in contact with solid particles (e.g., clay or sand particles within soil), adhesive intermolecular forces between the water and the solid can be large and important
broader: https://sms-cv.helmholtz.cloud/sms/cv/api/v1/samplingmedia/6/