Electrical current device
type: Concept
definition: Operating parameter of a device. Current consumption of a device.
broader: https://sms-cv.helmholtz.cloud/sms/cv/api/v1/samplingmedia/1/
alternative label: Electrical Current Device
alternative label: ECurrDev