Cloud base altitude
type: Concept
definition: Cloud_base refers to the base of the lowest cloud. Altitude is the (geometric) height above the geoid, which is the reference geopotential surface. The geoid is similar to mean sea level.
broader: https://sms-cv.helmholtz.cloud/sms/cv/api/v1/samplingmedia/9/
alternative label: cloud_base_altitude