Elevation
type: Concept
broader: https://sms-cv.helmholtz.cloud/sms/cv/api/v1/samplingmedia/5/
definition: A measure (or condition) of height, especially with respect to the height of a point on the earth's surface above a reference plane (usually mean sea level), as "station elevation."