Azimuth
type: Concept
definition: The length of the arc of the horizon (in degrees) intercepted between a given point and a reference direction, usually north, and measured clockwise from the reference direction.
broader: https://sms-cv.helmholtz.cloud/sms/cv/api/v1/samplingmedia/5/