Wind stress
type: Concept
definition: Drag or trangential force per unit area exerted on a surface by the adjacent layer of moving air
broader: https://sms-cv.helmholtz.cloud/sms/cv/api/v1/samplingmedia/9/
alternative label: WindStress