Wind Run
type: Concept
definition: The length of flow of air past a point over a time interval. Windspeed times the interval of time.
broader: https://sms-cv.helmholtz.cloud/sms/cv/api/v1/samplingmedia/9/
alternative label: WindRun