Water Use, Commercial + Industrial + Power
type: Concept
alternative label: WUseCIP
broader: https://sms-cv.helmholtz.cloud/sms/cv/api/v1/samplingmedia/7/
definition: Water pumped by commercial, industrial users.