Water column equivalent height, barometric
type: Concept
alternative label: MCAEqvBar
broader: https://sms-cv.helmholtz.cloud/sms/cv/api/v1/samplingmedia/7/
definition: Barometric pressure expressed as an equivalent height of water over the sensor.