Water column equivalent height, absolute
type: Concept
alternative label: MCAEqvAbs
broader: https://sms-cv.helmholtz.cloud/sms/cv/api/v1/samplingmedia/7/
definition: The absolute pressure (combined water + barometric) on a sensor expressed as the height of an equivalent column of water.