Watchdog error count
type: Concept
alternative label: Watchdog
broader: https://sms-cv.helmholtz.cloud/sms/cv/api/v1/samplingmedia/1/
definition: A counter which counts the number of total datalogger watchdog errors