Vegetation type
type: Concept
alternative label: VegType
broader: https://sms-cv.helmholtz.cloud/sms/cv/api/v1/samplingmedia/4/
definition: Vegetation is an assemblage of plant species and the ground cover they provide.