THW Index
type: Concept
definition: The THW Index uses temperature, humidity, and wind speed to calculate an apparent temperature.
broader: https://sms-cv.helmholtz.cloud/sms/cv/api/v1/samplingmedia/9/
alternative label: THW