THSW Index
type: Concept
alternative label: THSW
broader: https://sms-cv.helmholtz.cloud/sms/cv/api/v1/samplingmedia/9/
definition: The THSW Index uses temperature, humidity, solar radiation, and wind speed to calculate an apparent temperature.