TDR waveform relative length
type: Concept
alternative label: TDRRelLen
broader: https://sms-cv.helmholtz.cloud/sms/cv/api/v1/samplingmedia/6/
definition: Time domain reflextometry, apparent length divided by probe length. Square root of dielectric