Taxa count
type: Concept
definition: Count of unique taxa. A taxon (plural: taxa) is a group of one (or more) populations of organism(s), which is judged to be a unit.
broader: https://sms-cv.helmholtz.cloud/sms/cv/api/v1/samplingmedia/11/
alternative label: TaxaCount