Atmospheric pressure
type: Concept
definition: The pressure exerted by the weight of the air in the Earth's atmosphere.
broader: https://sms-cv.helmholtz.cloud/sms/cv/api/v1/samplingmedia/9/
alternative label: ATM
alternative label: air_pressure
alternative label: Barometric pressure