Soil respiration
type: Concept
alternative label: SoilResp
broader: https://sms-cv.helmholtz.cloud/sms/cv/api/v1/samplingmedia/6/
definition: Soil respiration refers to the production of carbon dioxide when soil organisms respire. This includes respiration of plant roots, the rhizosphere, microbes and fauna.