Soil horizon
type: Concept
alternative label: SoilHoriz
broader: https://sms-cv.helmholtz.cloud/sms/cv/api/v1/samplingmedia/6/
definition: A soil horizon is a layer parallel to the soil surface, whose physical characteristics differ from the layers above and beneath. Each soil type usually has three or four horizons.