Soil coarse fraction
type: Concept
alternative label: SoilFrac
broader: https://sms-cv.helmholtz.cloud/sms/cv/api/v1/samplingmedia/6/
definition: Fraction of particles within a soil sample that are greater that 2mm in diameter