Sediment, retained on sieve
type: Concept
alternative label: SedRetain
broader: https://sms-cv.helmholtz.cloud/sms/cv/api/v1/samplingmedia/7/
definition: The amount of sediment retained on a sieve in a gradation test