Sediment, passing sieve
type: Concept
definition: The amount of sediment passing a sieve in a gradation test
broader: https://sms-cv.helmholtz.cloud/sms/cv/api/v1/samplingmedia/7/
alternative label: SedPass