Respiration, ecosystem
type: Concept
alternative label: RespEco
broader: https://sms-cv.helmholtz.cloud/sms/cv/api/v1/samplingmedia/4/
definition: Gross carbon dioxide production by all organisms in an ecosystem. Ecosystem respiration is the sum of all respiration occurring by the living organisms in a specific ecosystem.