Resistivity, electrical
type: Concept
alternative label: EResist
broader: https://sms-cv.helmholtz.cloud/sms/cv/api/v1/samplingmedia/1/
definition: The electrical resistance of an object is a measure of its opposition to the flow of electric current. The inverse quantity is electrical conductance, and is the ease with which an electric current passes.