Received signal strength indication
type: Concept
alternative label: RecSigInd
broader: https://sms-cv.helmholtz.cloud/sms/cv/api/v1/samplingmedia/1/
definition: In telecommunications, received signal strength indicator (RSSI) is a measurement of the power present in a received radio signal.