Primary productivity, gross
type: Concept
alternative label: PrimProdG
broader: https://sms-cv.helmholtz.cloud/sms/cv/api/v1/samplingmedia/4/
definition: Rate at which an ecosystem accumulates energy by fixation of sunlight, including that consumed by the ecosystem.