Position
type: Concept
alternative label: Pos
broader: https://sms-cv.helmholtz.cloud/sms/cv/api/v1/samplingmedia/5/
definition: Position of an element that interacts with water such as reservoir gates