LSI
type: Concept
broader: https://sms-cv.helmholtz.cloud/sms/cv/api/v1/samplingmedia/2/
definition: Langelier Saturation Index is an indicator of the degree of saturation of water with respect to calcium carbonate