Litter, plant
type: Concept
alternative label: LitterP
broader: https://sms-cv.helmholtz.cloud/sms/cv/api/v1/samplingmedia/4/
definition: Litterfall, plant litter, leaf litter, tree litter, soil litter, or duff, is dead plant material (such as leaves, bark, needles, twigs, and cladodes) that have fallen to the ground.