Leaf area index (LAI)
type: Concept
definition: Leaf area index (LAI) is a dimensionless quantity that characterizes plant canopies. It is defined as the one-sided green leaf area per unit ground surface area (LAI = leaf area / ground area, m2 / m2) in broadleaf canopies.
broader: https://sms-cv.helmholtz.cloud/sms/cv/api/v1/samplingmedia/4/
alternative label: LAI