Land classification
type: Concept
alternative label: LandClass
broader: https://sms-cv.helmholtz.cloud/sms/cv/api/v1/samplingmedia/14/
definition: Geographical land classification- genetically homogeneous territorial unit within natural boundaries with a certain structure and a certain character of interrelationships of considered components