Hydrogen-2, stable isotope ratio delta
type: Concept
alternative label: DHDelta
broader: https://sms-cv.helmholtz.cloud/sms/cv/api/v1/samplingmedia/7/
definition: Difference in the 2H:1H ratio between the sample and standard